Target
High affinity nerve growth factor receptor
Ligand
BDBM376042
Substrate
Meas. Tech.
DiscoverX PathHunter Assay
IC50
1005±n/a nM
Citation
 Mitchell, HFraley, MECooke, AJStump, CAZhang, XMcComas, CCSchirripa, KMcWherter, MLiu, PParker, DLi, CSMao, Q TrKA kinase inhibitors, compositions and methods thereof US Patent  US9914736 Publication Date 3/13/2018 
Target
Name:
High affinity nerve growth factor receptor
Synonyms:
2.7.10.1 NTRK1 NTRK1_HUMAN Neurotrophic tyrosine kinase receptor type 1 Synonyms=MTC TRK1-transforming tyrosine kinase protein TRKA GN Trk-A Tropomyosin-related kinase A Tyrosine kinase receptor Tyrosine kinase receptor A Tyrosine kinase receptor A (Trk-A) gp140trk | p140-TrkA
Type:
Mol. Mass.:
87498.18
Organism:
Homo sapiens (Human)
Description:
P04629
Residue:
796
  
Inhibitor
Name:
BDBM376042
Synonyms:
3-(1-methyl-1H-pyrazol-3-yl)- N-(5-oxo-2-phenyl-2,5- dihydro-1H-pyrazol-3-yl)-4- (trifluoromethyl)benzamide | US9914736, Compound 38
Type:
Small organic molecule
Emp. Form.:
C21H16F3N5O2
Mol. Mass.:
427.3792
SMILES:
Cn1ccc(n1)-c1cc(ccc1C(F)(F)F)C(=O)Nc1cc(=O)[nH]n1-c1ccccc1
: