Target
High affinity nerve growth factor receptor
Ligand
BDBM376118
Substrate
Meas. Tech.
DiscoverX PathHunter Assay
IC50
2.40±n/a nM
Citation
 Mitchell, HFraley, MECooke, AJStump, CAZhang, XMcComas, CCSchirripa, KMcWherter, MLiu, PParker, DLi, CSMao, Q TrKA kinase inhibitors, compositions and methods thereof US Patent  US9914736 Publication Date 3/13/2018 
Target
Name:
High affinity nerve growth factor receptor
Synonyms:
2.7.10.1 NTRK1 NTRK1_HUMAN Neurotrophic tyrosine kinase receptor type 1 Synonyms=MTC TRK1-transforming tyrosine kinase protein TRKA GN Trk-A Tropomyosin-related kinase A Tyrosine kinase receptor Tyrosine kinase receptor A Tyrosine kinase receptor A (Trk-A) gp140trk | p140-TrkA
Type:
Mol. Mass.:
87498.18
Organism:
Homo sapiens (Human)
Description:
P04629
Residue:
796
  
Inhibitor
Name:
BDBM376118
Synonyms:
2-fluoro-N-(1-(4- fluorophenyl)-3-(2- (methylamino)-2-oxoethyl)- 1H-pyrazol-5-yl)-5-(1-methyl- 1H-pyrazol-3-yl)-4- (trifluoromethyl)benzamide | US9914736, Compound 114
Type:
Small organic molecule
Emp. Form.:
C24H19F5N6O2
Mol. Mass.:
518.4387
SMILES:
CNC(=O)Cc1cc(NC(=O)c2cc(-c3ccn(C)n3)c(cc2F)C(F)(F)F)n(n1)-c1ccc(F)cc1
: