Target
Equilibrative nucleoside transporter 1
Ligand
BDBM23674
Substrate
BDBM23618
Meas. Tech.
Flow Cytometric Assay
Ki
120.7±n/a nM
IC50
2136 ±n/a nM
Citation
 Lin, WBuolamwini, JK Synthesis, flow cytometric evaluation, and identification of highly potent dipyridamole analogues as equilibrative nucleoside transporter 1 inhibitors. J Med Chem 50:3906-20 (2007)  
Target
Name:
Equilibrative nucleoside transporter 1
Synonyms:
ENT1 Equilibrative Nucleoside Transporter 1 (ENT1) Equilibrative nucleoside transporter 1 S29A1_HUMAN Solute carrier family 29 member 1
Type:
Multi-pass membrane protein
Mol. Mass.:
50225.92
Organism:
Homo sapiens (Human)
Description:
Residue:
456
  
Inhibitor
Name:
BDBM23674
Synonyms:
2-({6-[bis(2-hydroxyethyl)amino]-4,8-bis[(3-methylbutyl)amino]pyrimido[5,4-d][1,3]diazin-2-yl}(2-hydroxyethyl)amino)ethan-1-ol | Dipyridamole Analogue, 56
Type:
Small organic molecule
Emp. Form.:
C24H44N8O4
Mol. Mass.:
508.6574
SMILES:
CC(C)CCNc1nc(nc2c(NCCC(C)C)nc(nc12)N(CCO)CCO)N(CCO)CCO
:
Substrate
Name:
BDBM23618
Synonyms:
5-(SAENTA)-X8-fluorescein | 5-[(5-{[2-({[(2S,3S,4R,5R)-3,4-dihydroxy-5-(6-{[(4-nitrophenyl)methyl]amino}-9H-purin-9-yl)oxolan-2-yl]methyl}sulfanyl)ethyl]carbamoyl}pentyl)carbamoyl]-2-(6-hydroxy-3-oxo-3H-xanthen-9-yl)benzoic acid
Type:
Fluorescent probe
Emp. Form.:
C46H44N8O12S
Mol. Mass.:
932.953
SMILES:
O[C@@H]1[C@@H](CSCCNC(=O)CCCCCNC(=O)c2ccc(c(c2)C(O)=O)-c2c3ccc(O)cc3oc3cc(=O)ccc23)O[C@H]([C@@H]1O)n1cnc2c(NCc3ccc(cc3)[N+]([O-])=O)ncnc12
: