Target
Equilibrative nucleoside transporter 1
Ligand
BDBM23693
Substrate
BDBM23618
Meas. Tech.
Flow Cytometric Assay
Ki
17.1±n/a nM
IC50
302±n/a nM
Citation
 Lin, WBuolamwini, JK Synthesis, flow cytometric evaluation, and identification of highly potent dipyridamole analogues as equilibrative nucleoside transporter 1 inhibitors. J Med Chem 50:3906-20 (2007)  
Target
Name:
Equilibrative nucleoside transporter 1
Synonyms:
ENT1 Equilibrative Nucleoside Transporter 1 (ENT1) Equilibrative nucleoside transporter 1 S29A1_HUMAN Solute carrier family 29 member 1
Type:
Multi-pass membrane protein
Mol. Mass.:
50225.92
Organism:
Homo sapiens (Human)
Description:
Residue:
456
  
Inhibitor
Name:
BDBM23693
Synonyms:
2-[(6-{bis[2-(acetyloxy)ethyl]amino}-4,8-bis(piperidin-1-yl)pyrimido[5,4-d][1,3]diazin-2-yl)[2-(acetyloxy)ethyl]amino]ethyl acetate | Dipyridamole Analogue, 75
Type:
Small organic molecule
Emp. Form.:
C32H48N8O8
Mol. Mass.:
672.7723
SMILES:
CC(=O)OCCN(CCOC(C)=O)c1nc(N2CCCCC2)c2nc(nc(N3CCCCC3)c2n1)N(CCOC(C)=O)CCOC(C)=O
:
Substrate
Name:
BDBM23618
Synonyms:
5-(SAENTA)-X8-fluorescein | 5-[(5-{[2-({[(2S,3S,4R,5R)-3,4-dihydroxy-5-(6-{[(4-nitrophenyl)methyl]amino}-9H-purin-9-yl)oxolan-2-yl]methyl}sulfanyl)ethyl]carbamoyl}pentyl)carbamoyl]-2-(6-hydroxy-3-oxo-3H-xanthen-9-yl)benzoic acid
Type:
Fluorescent probe
Emp. Form.:
C46H44N8O12S
Mol. Mass.:
932.953
SMILES:
O[C@@H]1[C@@H](CSCCNC(=O)CCCCCNC(=O)c2ccc(c(c2)C(O)=O)-c2c3ccc(O)cc3oc3cc(=O)ccc23)O[C@H]([C@@H]1O)n1cnc2c(NCc3ccc(cc3)[N+]([O-])=O)ncnc12
: