Target
Beta-secretase 1 [1-460]
Ligand
BDBM136839
Substrate
Meas. Tech.
FRET Assay
IC50
16300±n/a nM
Citation
 Csjernyik, GKarlstrom, SKers, AKolmodin, KNylof, MOhberg, LRakos, LSandberg, LSehgelmeble, FSoderman, PSwahn, BVon Berg, S Compounds and their use as BACE inhibitors US Patent  US9918985 Publication Date 3/20/2018 
Target
Name:
Beta-secretase 1 [1-460]
Synonyms:
BACE BACE1_HUMAN Beta-secretase 1 (aa 1-460) | KIAA1149
Type:
Protein
Mol. Mass.:
50987.78
Organism:
Homo sapiens (Human)
Description:
P56817[1-460]
Residue:
460
  
Inhibitor
Name:
BDBM136839
Synonyms:
US10231967, Example 77 US9918985, Example 77
Type:
Small organic molecule
Emp. Form.:
C14H14BrN3
Mol. Mass.:
304.185
SMILES:
CC1=NC2(N=C1N)c1cc(Br)ccc1CC21CC1
: