Target
Bromodomain-containing protein 2
Ligand
BDBM376551
Substrate
Meas. Tech.
AlphaScreen Assay
IC50
<100±n/a nM
Citation
 Yue, EWCombs, APDouty, B Substituted pyrrolo[2,3-c]pyridines and pyrazolo[3,4-c]pyridines as BET protein inhibitors US Patent  US9918990 Publication Date 3/20/2018 
Target
Name:
Bromodomain-containing protein 2
Synonyms:
BRD2 Bromodomain and extra-terminal motif (BET) Bromodomain-containing protein 2 (BRD2) RING3
Type:
Protein
Mol. Mass.:
88085.95
Organism:
Homo sapiens (Human)
Description:
P25440
Residue:
801
  
Inhibitor
Name:
BDBM376551
Synonyms:
US9918990, Example 12
Type:
Small organic molecule
Emp. Form.:
C19H18N4O2
Mol. Mass.:
334.3718
SMILES:
Cn1cc(-c2ccc3[nH]cnc3c2OCC2CC2)c2cc[nH]c2c1=O
: