Target
Bromodomain-containing protein 2
Ligand
BDBM376600
Substrate
Meas. Tech.
AlphaScreen Assay
IC50
<100±n/a nM
Citation
 Yue, EWCombs, APDouty, B Substituted pyrrolo[2,3-c]pyridines and pyrazolo[3,4-c]pyridines as BET protein inhibitors US Patent  US9918990 Publication Date 3/20/2018 
Target
Name:
Bromodomain-containing protein 2
Synonyms:
BRD2 Bromodomain and extra-terminal motif (BET) Bromodomain-containing protein 2 (BRD2) RING3
Type:
Protein
Mol. Mass.:
88085.95
Organism:
Homo sapiens (Human)
Description:
P25440
Residue:
801
  
Inhibitor
Name:
BDBM376600
Synonyms:
4-[4-(2-Fluorophenoxy)-1-methyl-1H- benzimidazol-5-yl]-6-methyl-1,6-dihydro-7H- pyrrolo[2,3-c]pyridin-7-one | US9918990, Example 57
Type:
Small organic molecule
Emp. Form.:
C22H17FN4O2
Mol. Mass.:
388.3944
SMILES:
Cn1cnc2c(Oc3ccccc3F)c(ccc12)-c1cn(C)c(=O)c2[nH]ccc12
: