Target
MAP kinase-interacting serine/threonine-protein kinase 2
Ligand
BDBM181401
Substrate
Meas. Tech.
MNK2a In Vitro Kinase Assay 2
Temperature
298.15±n/a K
IC50
1.000±n/a nM
Comments
extracted
Citation
 Blum, AGottschling, DHeckel, AHehn, JPSchmid, BWiedenmayer, D Sulfoximine substituted quinazolines for pharmaceutical compositions US Patent  US9708274 Publication Date 7/18/2017 
Target
Name:
MAP kinase-interacting serine/threonine-protein kinase 2
Synonyms:
GPRK7 MAP kinase-interacting serine/threonine-protein kinase 2 (MKNK2) MAP-kinase interacting kinase 2 (MNK2) MKNK2_HUMAN | MNK2
Type:
Protein
Mol. Mass.:
51870.79
Organism:
Homo sapiens (Human)
Description:
Q9HBH9
Residue:
465
  
Inhibitor
Name:
BDBM181401
Synonyms:
US9139577, 2.009 | US9708274, 2.009
Type:
Small organic molecule
Emp. Form.:
C24H26N6O3S
Mol. Mass.:
478.567
SMILES:
C[C@@H](Oc1ncccc1Nc1ncnc2cc(cc(C)c12)N=S1(=O)CCCC1)c1cc(C)no1
: