Target
MAP kinase-interacting serine/threonine-protein kinase 2
Ligand
BDBM261870
Substrate
Meas. Tech.
MNK2a In Vitro Kinase Assay 2
Temperature
298.15±n/a K
IC50
1.000±n/a nM
Comments
extracted
Citation
 Blum, AGottschling, DHeckel, AHehn, JPSchmid, BWiedenmayer, D Sulfoximine substituted quinazolines for pharmaceutical compositions US Patent  US9708274 Publication Date 7/18/2017 
Target
Name:
MAP kinase-interacting serine/threonine-protein kinase 2
Synonyms:
GPRK7 MAP kinase-interacting serine/threonine-protein kinase 2 (MKNK2) MAP-kinase interacting kinase 2 (MNK2) MKNK2_HUMAN | MNK2
Type:
Protein
Mol. Mass.:
51870.79
Organism:
Homo sapiens (Human)
Description:
Q9HBH9
Residue:
465
  
Inhibitor
Name:
BDBM261870
Synonyms:
US9708274, 4.136
Type:
Small organic molecule
Emp. Form.:
C24H24F5N5O3S
Mol. Mass.:
557.536
SMILES:
C[C@@H](Oc1cc(F)ccc1Nc1ncnc2cc(cc(F)c12)N=S1(=O)CCCC1)C(=O)N[C@@H](C)C(F)(F)F
: