Target
Nuclear receptor ROR-gamma
Ligand
BDBM190299
Substrate
IC50
15.2±n/a nM
Citation
 Schnute, ME Methyl- and trifluoromethyl-substituted pyrrolopyridine modulators of RORC2 and methods of use thereof US Patent  US9920054 Publication Date 3/20/2018 
Target
Name:
Nuclear receptor ROR-gamma
Synonyms:
NR1F3 Nuclear receptor ROR-gamma (RORC) RAR-related orphan receptor C (RORc) RORG RZRG Retinoid-related orphan receptor-gamma (RORc)
Type:
Enzyme Catalytic Domain
Mol. Mass.:
58218.40
Organism:
Homo sapiens (Human)
Description:
P51449
Residue:
518
  
Inhibitor
Name:
BDBM190299
Synonyms:
US10227346, Example 61 US9670201, 61 (R)-3-cyano-N-(3-(1-(cyclopentanecarbonyl)-2,2-dimethylpiperidin-4-yl)-1,4-dimethyl-1H-pyrrolo[2,3-b]pyridin-5-yl)-4-fluorobenzamide | US9920054, Example 61
Type:
Small organic molecule
Emp. Form.:
C30H34FN5O2
Mol. Mass.:
515.6217
SMILES:
Cc1c(NC(=O)c2ccc(F)c(c2)C#N)cnc2n(C)cc([C@@H]3CCN(C(=O)C4CCCC4)C(C)(C)C3)c12
: