Target
ALK tyrosine kinase receptor
Ligand
BDBM376999
Substrate
Meas. Tech.
Enzyme Activity Inhibition IC50 Evaluation
IC50
9.10±n/a nM
Citation
 Zhang, NXu, ZWang, TWang, Y Condensed-ring pyrimidylamino derivative, preparation method therefor, and intermediate, pharmaceutical composition and applications thereof US Patent  US10259816 Publication Date 4/16/2019 
Target
Name:
ALK tyrosine kinase receptor
Synonyms:
ALK ALK_HUMAN CD_antigen: CD246
Type:
Protein
Mol. Mass.:
176453.10
Organism:
Homo sapiens (Human)
Description:
Q9UM73
Residue:
1620
  
Inhibitor
Name:
BDBM376999
Synonyms:
7-[2-Methoxy-4-trifluoromethylphenyl]-6-methyl-N-[4-(piperidin-4-yl)-2,3-dihydro-1-benzofuran-7-yl]thieno[3,2-d]pyrimidin-2-amine US10611770, Compound 18
Type:
Small organic molecule
Emp. Form.:
C28H27F3N4O2S
Mol. Mass.:
540.6
SMILES:
COc1cc(ccc1-c1c(C)sc2cnc(Nc3ccc(C4CCNCC4)c4CCOc34)nc12)C(F)(F)F
: