Target
ALK tyrosine kinase receptor
Ligand
BDBM261674
Substrate
Meas. Tech.
ALK Kinase Inhibition Activity Assay
IC50
536±n/a nM
Citation
 Xiao, DXu, XLiu, XHu, YYu, HLiu, ZPeng, YSun, YLuo, HKong, FHan, YSun, J Substituted 2-aminopyridine protein kinase inhibitor US Patent  US9708295 Publication Date 7/18/2017 
Target
Name:
ALK tyrosine kinase receptor
Synonyms:
ALK ALK_HUMAN CD_antigen: CD246
Type:
Protein
Mol. Mass.:
176453.10
Organism:
Homo sapiens (Human)
Description:
Q9UM73
Residue:
1620
  
Inhibitor
Name:
BDBM261674
Synonyms:
US9708295, 1
Type:
Small organic molecule
Emp. Form.:
C25H24ClFN6O
Mol. Mass.:
478.949
SMILES:
COc1cc(ccc1-c1cnc(N)cc1-c1ccnn1-c1ccc(F)c(Cl)c1)N1CCNCC1
: