Target
Histone-lysine N-methyltransferase SMYD3
Ligand
BDBM378453
Substrate
Meas. Tech.
SMYD3 Biochemical Assay
IC50
1.89±n/a nM
Citation
 Foley, MAKuntz, KWMills, JEMitchell, LHMunchhof, MJHarvey, DM Substituted 1,2,3-triazoles as SMYD inhibitors for treating cancer US Patent  US10266526 Publication Date 4/23/2019 
Target
Name:
Histone-lysine N-methyltransferase SMYD3
Synonyms:
SET and MYND domain-containing protein 3 SMYD3_HUMAN ZNFN3A1 | Zinc finger MYND domain-containing protein 1
Type:
Enzyme
Mol. Mass.:
49101.22
Organism:
Homo sapiens (Human)
Description:
Q9H7B4-2
Residue:
428
  
Inhibitor
Name:
BDBM378453
Synonyms:
6-chloro-N-((1R,3r,5S)-8-((4-(methylamino)piperidin-1-yl)sulfonyl)-8-azabicyclo[3.2.1]octan-3-yl)-2-oxoindoline-5-carboxamide | US10266526, Compound 586
Type:
Small organic molecule
Emp. Form.:
C22H30ClN5O4S
Mol. Mass.:
496.023
SMILES:
CNC1CCN(CC1)S(=O)(=O)N1[C@H]2CC[C@@H]1C[C@@H](C2)NC(=O)c1cc2CC(=O)Nc2cc1Cl
: