Target
Tyrosine-protein kinase BTK
Ligand
BDBM378863
Substrate
Meas. Tech.
Detection of In Vitro Inhibition Activity (Enzymatic Activity)
IC50
216±n/a nM
Citation
 Liu, JLiu, QLi, XWang, AWu, HChen, CWang, WHu, CZhao, ZWu, JLiu, JYu, KWang, WWang, LWang, B Inhibitor of FLT3 kinase and use thereof US Patent  US10266535 Publication Date 4/23/2019 
Target
Name:
Tyrosine-protein kinase BTK
Synonyms:
AGMX1 Agammaglobulinaemia tyrosine kinase B cell progenitor kinase BPK BTK_HUMAN Tyrosine Kinase BTK Tyrosine-protein kinase BTK (BTK)
Type:
Enzyme
Mol. Mass.:
76289.95
Organism:
Homo sapiens (Human)
Description:
Q06187
Residue:
659
  
Inhibitor
Name:
BDBM378863
Synonyms:
US10266535, Compound 25
Type:
Small organic molecule
Emp. Form.:
C28H33N7O2
Mol. Mass.:
499.6073
SMILES:
CC[C@@H](C)[C@@H](N)C(=O)N1CCC[C@H](C1)n1nc(-c2ccc(Oc3ccccc3)cc2)c2c(N)ncnc12
: