Target
Receptor-type tyrosine-protein kinase FLT3
Ligand
BDBM378865
Substrate
Meas. Tech.
Detection of In Vitro Inhibition Activity (Enzymatic Activity)
IC50
144±n/a nM
Citation
 Liu, JLiu, QLi, XWang, AWu, HChen, CWang, WHu, CZhao, ZWu, JLiu, JYu, KWang, WWang, LWang, B Inhibitor of FLT3 kinase and use thereof US Patent  US10266535 Publication Date 4/23/2019 
Target
Name:
Receptor-type tyrosine-protein kinase FLT3
Synonyms:
CD135 FL cytokine receptor FLK2 FLT3 Fetal liver kinase-2 Fms-like tyrosine kinase 3 (Flt-3) STK-1 Stem cell tyrosine kinase 1
Type:
Enzyme
Mol. Mass.:
112888.62
Organism:
Homo sapiens (Human)
Description:
P36888
Residue:
993
  
Inhibitor
Name:
BDBM378865
Synonyms:
US10266535, Compound 27
Type:
Small organic molecule
Emp. Form.:
C28H33N7O2
Mol. Mass.:
499.6073
SMILES:
CC(C)C[C@@H](N)C(=O)N1CCC[C@H](C1)n1nc(-c2ccc(Oc3ccccc3)cc2)c2c(N)ncnc12
: