Target
Tyrosine-protein kinase BTK
Ligand
BDBM378879
Substrate
Meas. Tech.
Detection of In Vitro Inhibition Activity (Enzymatic Activity)
IC50
343±n/a nM
Citation
 Liu, JLiu, QLi, XWang, AWu, HChen, CWang, WHu, CZhao, ZWu, JLiu, JYu, KWang, WWang, LWang, B Inhibitor of FLT3 kinase and use thereof US Patent  US10266535 Publication Date 4/23/2019 
Target
Name:
Tyrosine-protein kinase BTK
Synonyms:
AGMX1 Agammaglobulinaemia tyrosine kinase B cell progenitor kinase BPK BTK_HUMAN Tyrosine Kinase BTK Tyrosine-protein kinase BTK (BTK)
Type:
Enzyme
Mol. Mass.:
76289.95
Organism:
Homo sapiens (Human)
Description:
Q06187
Residue:
659
  
Inhibitor
Name:
BDBM378879
Synonyms:
US10266535, Compound 78
Type:
Small organic molecule
Emp. Form.:
C24H26N6O3S
Mol. Mass.:
478.567
SMILES:
CS(=O)(=O)NC1CC[C@@H](CC1)n1nc(-c2ccc(Oc3ccccc3)cc2)c2c(N)ncnc12
: