Target
Proto-oncogene tyrosine-protein kinase Src [1-530]
Ligand
BDBM378887
Substrate
Meas. Tech.
Kinase Inhibition Assays
IC50
2.00±n/a nM
Citation
 Yang, SWei, Y 3-acetylenyl-pyrazole-pyrimidine derivative, and preparation method therefor and uses thereof US Patent  US10266537 Publication Date 4/23/2019 
Target
Name:
Proto-oncogene tyrosine-protein kinase Src [1-530]
Synonyms:
Proto-oncogene tyrosine-protein kinase Src (aa 1-530) SRC1 c-Src (aa 1-530)
Type:
Mol. Mass.:
59200.93
Organism:
Homo sapiens (Human)
Description:
P12931[1-530]
Residue:
530
  
Inhibitor
Name:
BDBM378887
Synonyms:
US10266537, Compound 31
Type:
Small organic molecule
Emp. Form.:
C28H26F3N7O
Mol. Mass.:
533.5475
SMILES:
CN1CCC(CC1)n1nc(C#Cc2cc(NC(=O)c3cccc(c3)C(F)(F)F)ccc2C)c2c(N)ncnc12
: