Target
Serine/threonine-protein kinase B-raf [V600E]
Ligand
BDBM378887
Substrate
Meas. Tech.
Kinase Inhibition Assays
IC50
5.00±n/a nM
Citation
 Yang, SWei, Y 3-acetylenyl-pyrazole-pyrimidine derivative, and preparation method therefor and uses thereof US Patent  US10266537 Publication Date 4/23/2019 
Target
Name:
Serine/threonine-protein kinase B-raf [V600E]
Synonyms:
B-RAF V600E B-Raf Protein Kinase Mutant (V600E) BRAF BRAF mutant V600E BRAF_HUMAN Protein mono-ADP-ribosyltransferase (PARP3) RAFB1 Serine/threonine-protein kinase B-raf (V600E) V-RAF murine sarcoma viral oncogene homologue B1 mutant (BRAF V600E)
Type:
Mol. Mass.:
84474.98
Organism:
Homo sapiens (Human)
Description:
P15056 V600E
Residue:
766
  
Inhibitor
Name:
BDBM378887
Synonyms:
US10266537, Compound 31
Type:
Small organic molecule
Emp. Form.:
C28H26F3N7O
Mol. Mass.:
533.5475
SMILES:
CN1CCC(CC1)n1nc(C#Cc2cc(NC(=O)c3cccc(c3)C(F)(F)F)ccc2C)c2c(N)ncnc12
: