Target
Tyrosine-protein kinase Yes
Ligand
BDBM50086442
Substrate
Meas. Tech.
Kinase Inhibition Assays
IC50
2.00±n/a nM
Citation
 Yang, SWei, Y 3-acetylenyl-pyrazole-pyrimidine derivative, and preparation method therefor and uses thereof US Patent  US10266537 Publication Date 4/23/2019 
Target
Name:
Tyrosine-protein kinase Yes
Synonyms:
Proto-oncogene c-Yes YES YES_HUMAN | p61-yes
Type:
Protein
Mol. Mass.:
60801.54
Organism:
Homo sapiens (Human)
Description:
P07947
Residue:
543
  
Inhibitor
Name:
BDBM50086442
Synonyms:
CHEMBL3426233 | US10266537, Compound 121
Type:
Small organic molecule
Emp. Form.:
C36H38F3N9O2
Mol. Mass.:
685.7412
SMILES:
CN1CCN(Cc2ccc(NC(=O)c3ccc(C)c(c3)C#Cc3nn(C4CCN(CC4)C(=O)C=C)c4ncnc(N)c34)cc2C(F)(F)F)CC1
: