Target
Tyrosine-protein kinase Blk
Ligand
BDBM378887
Substrate
Meas. Tech.
Kinase Inhibition Assays
IC50
12.0±n/a nM
Citation
 Yang, SWei, Y 3-acetylenyl-pyrazole-pyrimidine derivative, and preparation method therefor and uses thereof US Patent  US10266537 Publication Date 4/23/2019 
Target
Name:
Tyrosine-protein kinase Blk
Synonyms:
B lymphoid tyrosine kinase BLK_HUMAN Tyrosine-protein kinase BLK (BLK) | p55-Blk
Type:
Protein
Mol. Mass.:
57711.88
Organism:
Homo sapiens (Human)
Description:
P51451
Residue:
505
  
Inhibitor
Name:
BDBM378887
Synonyms:
US10266537, Compound 31
Type:
Small organic molecule
Emp. Form.:
C28H26F3N7O
Mol. Mass.:
533.5475
SMILES:
CN1CCC(CC1)n1nc(C#Cc2cc(NC(=O)c3cccc(c3)C(F)(F)F)ccc2C)c2c(N)ncnc12
: