Target
Fibroblast growth factor receptor 1
Ligand
BDBM50086441
Substrate
Meas. Tech.
Kinase Inhibition Assays
IC50
3.00±n/a nM
Citation
 Yang, SWei, Y 3-acetylenyl-pyrazole-pyrimidine derivative, and preparation method therefor and uses thereof US Patent  US10266537 Publication Date 4/23/2019 
Target
Name:
Fibroblast growth factor receptor 1
Synonyms:
BFGFR Basic fibroblast growth factor receptor 1 (FGFR1) CEK FGFR-1 FGFR-1, (FL) FGFR1_HUMAN FLT2 Fibroblast growth factor receptor 1 (FGFR-1) Fms-like tyrosine kinase 2 N-sam bFGF-R | c-fgr
Type:
Receptor
Mol. Mass.:
91861.70
Organism:
Homo sapiens (Human)
Description:
P11362
Residue:
822
  
Inhibitor
Name:
BDBM50086441
Synonyms:
CHEMBL3426225 | US10266537, Compound 3
Type:
Small organic molecule
Emp. Form.:
C30H31F3N8O
Mol. Mass.:
576.6153
SMILES:
CCn1nc(C#Cc2cc(ccc2C)C(=O)Nc2ccc(CN3CCN(C)CC3)c(c2)C(F)(F)F)c2c(N)ncnc12
: