Target
Cytoplasmic tyrosine-protein kinase BMX
Ligand
BDBM378888
Substrate
Meas. Tech.
Kinase Inhibition Assays
IC50
11.0±n/a nM
Citation
 Yang, SWei, Y 3-acetylenyl-pyrazole-pyrimidine derivative, and preparation method therefor and uses thereof US Patent  US10266537 Publication Date 4/23/2019 
Target
Name:
Cytoplasmic tyrosine-protein kinase BMX
Synonyms:
BMX BMX_HUMAN Cytoplasmic tyrosine-protein kinase BMX (BMX) Epithelial and endothelial tyrosine kinase Tyrosine Kinase BMX | Tyrosine-protein kinase BMX/ETK
Type:
Tyrosine-protein kinase
Mol. Mass.:
78030.42
Organism:
Homo sapiens (Human)
Description:
P51813
Residue:
675
  
Inhibitor
Name:
BDBM378888
Synonyms:
Preparation of 3-(4-amino-1-(piperidin-4-yl)-1H-pyrazolo [3, 4-d] pyrimidin-3-yl) ethynyl)-4-methyl-((4-methylpiperazin-1-yl) methyl)-3-(trifluoromethyl) phenyl) benzamide | US10266537, Compound 120
Type:
Small organic molecule
Emp. Form.:
C33H35F3N8O3
Mol. Mass.:
648.678
SMILES:
CN1CCN(Cc2ccc(NC(=O)c3ccc(C)c(c3)C#Cc3nn(C(=O)OC(C)(C)C)c4ncnc(N)c34)cc2C(F)(F)F)CC1
: