Target
Tyrosine-protein kinase HCK
Ligand
BDBM378885
Substrate
Meas. Tech.
Kinase Inhibition Assays
IC50
3.00±n/a nM
Citation
 Yang, SWei, Y 3-acetylenyl-pyrazole-pyrimidine derivative, and preparation method therefor and uses thereof US Patent  US10266537 Publication Date 4/23/2019 
Target
Name:
Tyrosine-protein kinase HCK
Synonyms:
HCK Hematopoietic cell kinase p59-HCK/p60-HCK p61Hck
Type:
Enzyme Catalytic Domain
Mol. Mass.:
59600.18
Organism:
Homo sapiens (Human)
Description:
P08631
Residue:
526
  
Inhibitor
Name:
BDBM378885
Synonyms:
US10266537, Compound 93
Type:
Small organic molecule
Emp. Form.:
C29H27F3N6O2
Mol. Mass.:
548.5589
SMILES:
Cc1ccc(NC(=O)c2ccc(C)c(c2)C(F)(F)F)cc1C#Cc1nn([C@H]2CC[C@H](O)CC2)c2ncnc(N)c12
: