Target
Proto-oncogene tyrosine-protein kinase Src [1-530]
Ligand
BDBM378898
Substrate
Meas. Tech.
Kinase Inhibition Assays
IC50
11.0±n/a nM
Citation
 Yang, SWei, Y 3-acetylenyl-pyrazole-pyrimidine derivative, and preparation method therefor and uses thereof US Patent  US10266537 Publication Date 4/23/2019 
Target
Name:
Proto-oncogene tyrosine-protein kinase Src [1-530]
Synonyms:
Proto-oncogene tyrosine-protein kinase Src (aa 1-530) SRC1 c-Src (aa 1-530)
Type:
Mol. Mass.:
59200.93
Organism:
Homo sapiens (Human)
Description:
P12931[1-530]
Residue:
530
  
Inhibitor
Name:
BDBM378898
Synonyms:
US10266537, Compound 13
Type:
Small organic molecule
Emp. Form.:
C31H33F3N8O
Mol. Mass.:
590.6419
SMILES:
CC(C)n1nc(C#Cc2cc(ccc2C)C(=O)Nc2cc(CN3CCN(C)CC3)cc(c2)C(F)(F)F)c2c(N)ncnc12
: