Target
Proto-oncogene tyrosine-protein kinase Src [1-530]
Ligand
BDBM50086446
Substrate
Meas. Tech.
Kinase Inhibition Assays
IC50
8.00±n/a nM
Citation
 Yang, SWei, Y 3-acetylenyl-pyrazole-pyrimidine derivative, and preparation method therefor and uses thereof US Patent  US10266537 Publication Date 4/23/2019 
Target
Name:
Proto-oncogene tyrosine-protein kinase Src [1-530]
Synonyms:
Proto-oncogene tyrosine-protein kinase Src (aa 1-530) SRC1 c-Src (aa 1-530)
Type:
Mol. Mass.:
59200.93
Organism:
Homo sapiens (Human)
Description:
P12931[1-530]
Residue:
530
  
Inhibitor
Name:
BDBM50086446
Synonyms:
CHEMBL3426228 | US10266537, Compound 19
Type:
Small organic molecule
Emp. Form.:
C30H31F3N8O2
Mol. Mass.:
592.6147
SMILES:
COCn1nc(C#Cc2cc(ccc2C)C(=O)Nc2ccc(CN3CCN(C)CC3)c(c2)C(F)(F)F)c2c(N)ncnc12
: