Target
Proto-oncogene tyrosine-protein kinase Src [1-530]
Ligand
BDBM50086586
Substrate
Meas. Tech.
Kinase Inhibition Assays
IC50
5.00±n/a nM
Citation
 Yang, SWei, Y 3-acetylenyl-pyrazole-pyrimidine derivative, and preparation method therefor and uses thereof US Patent  US10266537 Publication Date 4/23/2019 
Target
Name:
Proto-oncogene tyrosine-protein kinase Src [1-530]
Synonyms:
Proto-oncogene tyrosine-protein kinase Src (aa 1-530) SRC1 c-Src (aa 1-530)
Type:
Mol. Mass.:
59200.93
Organism:
Homo sapiens (Human)
Description:
P12931[1-530]
Residue:
530
  
Inhibitor
Name:
BDBM50086586
Synonyms:
CHEMBL3426234 | US10266537, Compound 29
Type:
Small organic molecule
Emp. Form.:
C29H29F3N8O
Mol. Mass.:
562.5888
SMILES:
CCn1nc(C#Cc2cccc(c2)C(=O)Nc2ccc(CN3CCN(C)CC3)c(c2)C(F)(F)F)c2c(N)ncnc12
: