Target
Mitotic checkpoint serine/threonine-protein kinase BUB1
Ligand
BDBM378971
Substrate
Meas. Tech.
Bub1 Kinase Assay
IC50
5.50±n/a nM
Citation
 Hitchcock, MMengel, APütter, VSiemeister, GWengner, AMBriem, HEis, KSchulze, VFernandez-Montalvan, AEPrechtl, SHolton, SFanghänel, JLienau, PPreusse, CGnoth, MJ Substituted benzylindazoles for use as Bub1 kinase inhibitors in the treatment of hyperproliferative diseases US Patent  US10266548 Publication Date 4/23/2019 
Target
Name:
Mitotic checkpoint serine/threonine-protein kinase BUB1
Synonyms:
BUB1 BUB1L hBUB1
Type:
PROTEIN
Mol. Mass.:
122372.31
Organism:
Homo sapiens (Human)
Description:
ChEMBL_1510603
Residue:
1085
  
Inhibitor
Name:
BDBM378971
Synonyms:
2-[1-(2,6- difluoro-3- methylbenzyl)- 1H-indazol-3-yl]- 5-methoxy-N- (pyridin-4- yl)pyrimidin-4- amine | US10266548, Example 2-48-1
Type:
Small organic molecule
Emp. Form.:
C25H20F2N6O
Mol. Mass.:
458.4627
SMILES:
COc1cnc(nc1Nc1ccncc1)-c1nn(Cc2c(F)ccc(C)c2F)c2ccccc12
: