Target
Mitotic checkpoint serine/threonine-protein kinase BUB1
Ligand
BDBM379021
Substrate
Meas. Tech.
Bub1 Kinase Assay
IC50
5.20±n/a nM
Citation
 Hitchcock, MMengel, APütter, VSiemeister, GWengner, AMBriem, HEis, KSchulze, VFernandez-Montalvan, AEPrechtl, SHolton, SFanghänel, JLienau, PPreusse, CGnoth, MJ Substituted benzylindazoles for use as Bub1 kinase inhibitors in the treatment of hyperproliferative diseases US Patent  US10266548 Publication Date 4/23/2019 
Target
Name:
Mitotic checkpoint serine/threonine-protein kinase BUB1
Synonyms:
BUB1 BUB1L hBUB1
Type:
PROTEIN
Mol. Mass.:
122372.31
Organism:
Homo sapiens (Human)
Description:
ChEMBL_1510603
Residue:
1085
  
Inhibitor
Name:
BDBM379021
Synonyms:
Preparation of 2-[1-(4-ethoxy-2,6-difluorobenzyl)-1H-indazol-3-yl]-N-(pyridin-4-yl)pyrimidin-4-amine | US10266548, Example 5-1
Type:
Small organic molecule
Emp. Form.:
C25H20F2N6O
Mol. Mass.:
458.4627
SMILES:
CCOc1cc(F)c(Cn2nc(-c3nccc(Nc4ccncc4)n3)c3ccccc23)c(F)c1
: