Target
Mitotic checkpoint serine/threonine-protein kinase BUB1
Ligand
BDBM379025
Substrate
Meas. Tech.
Bub1 Kinase Assay
IC50
7.40±n/a nM
Citation
 Hitchcock, MMengel, APütter, VSiemeister, GWengner, AMBriem, HEis, KSchulze, VFernandez-Montalvan, AEPrechtl, SHolton, SFanghänel, JLienau, PPreusse, CGnoth, MJ Substituted benzylindazoles for use as Bub1 kinase inhibitors in the treatment of hyperproliferative diseases US Patent  US10266548 Publication Date 4/23/2019 
Target
Name:
Mitotic checkpoint serine/threonine-protein kinase BUB1
Synonyms:
BUB1 BUB1L hBUB1
Type:
PROTEIN
Mol. Mass.:
122372.31
Organism:
Homo sapiens (Human)
Description:
ChEMBL_1510603
Residue:
1085
  
Inhibitor
Name:
BDBM379025
Synonyms:
2-(1-{2,6-difluoro- 4-[(1E)-prop-1-en- 1-yl]benzyl}-1H- indazol-3-yl)-5- methoxy-N- (pyridin-4- yl)pyrimidin-4- amine | US10266548, Example 6-2
Type:
Small organic molecule
Emp. Form.:
C27H22F2N6O
Mol. Mass.:
484.5
SMILES:
COc1cnc(nc1Nc1ccncc1)-c1nn(Cc2c(F)cc(\C=C\C)cc2F)c2ccccc12
: