Target
Mitotic checkpoint serine/threonine-protein kinase BUB1
Ligand
BDBM379043
Substrate
Meas. Tech.
Bub1 Kinase Assay
IC50
7.20±n/a nM
Citation
 Hitchcock, MMengel, APütter, VSiemeister, GWengner, AMBriem, HEis, KSchulze, VFernandez-Montalvan, AEPrechtl, SHolton, SFanghänel, JLienau, PPreusse, CGnoth, MJ Substituted benzylindazoles for use as Bub1 kinase inhibitors in the treatment of hyperproliferative diseases US Patent  US10266548 Publication Date 4/23/2019 
Target
Name:
Mitotic checkpoint serine/threonine-protein kinase BUB1
Synonyms:
BUB1 BUB1L hBUB1
Type:
PROTEIN
Mol. Mass.:
122372.31
Organism:
Homo sapiens (Human)
Description:
ChEMBL_1510603
Residue:
1085
  
Inhibitor
Name:
BDBM379043
Synonyms:
2-({2-[1-(2- fluorobenzyl)- 1H-indazol-3-yl]- 4-(pyridin-4- ylamino) pyrimidin- 5-yl}oxy)ethanol | US10266548, Example 13-2
Type:
Small organic molecule
Emp. Form.:
C25H21FN6O2
Mol. Mass.:
456.4716
SMILES:
OCCOc1cnc(nc1Nc1ccncc1)-c1nn(Cc2ccccc2F)c2ccccc12
: