Target
Aromatase
Ligand
BDBM24307
Substrate
BDBM8592
Meas. Tech.
Aromatase Inhibition Assay
pH
7.5±n/a
Temperature
310.15±n/a K
IC50
3.2±0.3 nM
Citation
 Wood, PMWoo, LWLabrosse, JRTrusselle, MNAbbate, SLonghi, GCastiglioni, ELebon, FPurohit, AReed, MJPotter, BV Chiral aromatase and dual aromatase-steroid sulfatase inhibitors from the letrozole template: synthesis, absolute configuration, and in vitro activity. J Med Chem 51:4226-38 (2008)  
Target
Name:
Aromatase
Synonyms:
ARO1 CP19A_HUMAN CYP19 CYPXIX Cytochrome P450 19A1 Cytochrome P450-C19 (CYP19) FL cytokine receptor precursor | P-450AROM
Type:
Enzyme
Mol. Mass.:
57888.92
Organism:
Homo sapiens (Human)
Description:
P11511
Residue:
503
  
Inhibitor
Name:
BDBM24307
Synonyms:
Letrozole derivative, 40a R-(+) | {2-bromo-4-[(R)-(4-cyanophenyl)(1H-1,2,4-triazol-1-yl)methyl]phenyl} sulfamate
Type:
Small organic molecule
Emp. Form.:
C16H12BrN5O3S
Mol. Mass.:
434.267
SMILES:
NS(=O)(=O)Oc1ccc(cc1Br)[C@@H](c1ccc(cc1)C#N)n1cncn1
:
Substrate
Name:
BDBM8592
Synonyms:
(2R,15S)-2,15-dimethyltetracyclo[8.7.0.0^{2,7}.0^{11,15}]heptadec-6-ene-5,14-dione Androst-4-ene-3,17-dione [1beta-3H] androstenedione
Type:
Small organic molecule
Emp. Form.:
C19H26O2
Mol. Mass.:
286.4085
SMILES:
C[C@]12CCC3C(CCC4=CC(=O)CC[C@]34C)C1CCC2=O
: