Target
Steryl-sulfatase
Ligand
BDBM13062
Substrate
BDBM10022
Meas. Tech.
Sulfatase Inhibition Assay
pH
7.5±n/a
Temperature
310.15±n/a K
IC50
>10000±n/a nM
Citation
 Wood, PMWoo, LWLabrosse, JRTrusselle, MNAbbate, SLonghi, GCastiglioni, ELebon, FPurohit, AReed, MJPotter, BV Chiral aromatase and dual aromatase-steroid sulfatase inhibitors from the letrozole template: synthesis, absolute configuration, and in vitro activity. J Med Chem 51:4226-38 (2008)  
Target
Name:
Steryl-sulfatase
Synonyms:
ARSC1 Arylsulfatase C STS_HUMAN Steryl-sulfate sulfohydrolase
Type:
Enzyme
Mol. Mass.:
65503.66
Organism:
Homo sapiens (Human)
Description:
P08842
Residue:
583
  
Inhibitor
Name:
BDBM13062
Synonyms:
(4-{[4-(sulfamoyloxy)phenyl](1H-1,2,4-triazol-1-yl)methyl}phenyl) sulfamate JMC514226 Compound 3
Type:
Small organic molecule
Emp. Form.:
C15H15N5O6S2
Mol. Mass.:
425.44
SMILES:
NS(=O)(=O)Oc1ccc(cc1)C(c1ccc(OS(N)(=O)=O)cc1)n1cncn1
:
Substrate
Name:
BDBM10022
Synonyms:
13-methyl-17-oxo-3-sulfooxy-7,8,9,11,12,14,15,16-octahydro-6H-cyclopenta[a]phenanthrene [3H]Estrone 3-sulfate [6,7-3H] E1S | {15-methyl-14-oxotetracyclo[8.7.0.0^{2,7}.0^{11,15}]heptadeca-2(7),3,5-trien-5-yl}oxidanesulfonic acid
Type:
Small organic molecule
Emp. Form.:
C18H22O5S
Mol. Mass.:
350.429
SMILES:
CC12CCC3C(CCc4cc(OS(O)(=O)=O)ccc34)C1CCC2=O
: