Target
Tyrosine-protein kinase BTK
Ligand
BDBM380053
Substrate
Meas. Tech.
Homogeneous Time-Resolved Fluorescence (HTRF)
IC50
<100.0±n/a nM
Citation
 Han, YYu, RWang, ZLiang, ZHu, QZhu, LHu, YSun, YZhao, NPeng, YZhai, XLuo, HXiao, D Inhibitors of bruton's tyrosine kinase US Patent  US9926299 Publication Date 3/27/2018 
Target
Name:
Tyrosine-protein kinase BTK
Synonyms:
AGMX1 Agammaglobulinaemia tyrosine kinase B cell progenitor kinase BPK BTK_HUMAN Tyrosine Kinase BTK Tyrosine-protein kinase BTK (BTK)
Type:
Enzyme
Mol. Mass.:
76289.95
Organism:
Homo sapiens (Human)
Description:
Q06187
Residue:
659
  
Inhibitor
Name:
BDBM380053
Synonyms:
5-amino-1-cyclohexyl-3-(4-phenoxyphenyl)-1H-pyrazole-4-carboxamide | US9926299, 20
Type:
Small organic molecule
Emp. Form.:
C22H24N4O2
Mol. Mass.:
376.4516
SMILES:
NC(=O)c1c(N)n(nc1-c1ccc(Oc2ccccc2)cc1)C1CCCCC1
: