Target
Tyrosine-protein kinase BTK
Ligand
BDBM380071
Substrate
Meas. Tech.
Homogeneous Time-Resolved Fluorescence (HTRF)
IC50
<100.0±n/a nM
Citation
 Han, YYu, RWang, ZLiang, ZHu, QZhu, LHu, YSun, YZhao, NPeng, YZhai, XLuo, HXiao, D Inhibitors of bruton's tyrosine kinase US Patent  US9926299 Publication Date 3/27/2018 
Target
Name:
Tyrosine-protein kinase BTK
Synonyms:
AGMX1 Agammaglobulinaemia tyrosine kinase B cell progenitor kinase BPK BTK_HUMAN Tyrosine Kinase BTK Tyrosine-protein kinase BTK (BTK)
Type:
Enzyme
Mol. Mass.:
76289.95
Organism:
Homo sapiens (Human)
Description:
Q06187
Residue:
659
  
Inhibitor
Name:
BDBM380071
Synonyms:
1-(1-acryloylpiperidin-4-yl)-5-amino-3-(4-phenoxyphenyl)-1H-pyrazole-4-carboxamide | US9926299, 24
Type:
Small organic molecule
Emp. Form.:
C24H25N5O3
Mol. Mass.:
431.487
SMILES:
NC(=O)c1c(N)n(nc1-c1ccc(Oc2ccccc2)cc1)C1CCN(CC1)C(=O)C=C
: