Target
Tyrosine-protein kinase BTK
Ligand
BDBM380430
Substrate
Meas. Tech.
Homogeneous Time-Resolved Fluorescence (HTRF)
IC50
<100.0±n/a nM
Citation
 Han, YYu, RWang, ZLiang, ZHu, QZhu, LHu, YSun, YZhao, NPeng, YZhai, XLuo, HXiao, D Inhibitors of bruton's tyrosine kinase US Patent  US9926299 Publication Date 3/27/2018 
Target
Name:
Tyrosine-protein kinase BTK
Synonyms:
AGMX1 Agammaglobulinaemia tyrosine kinase B cell progenitor kinase BPK BTK_HUMAN Tyrosine Kinase BTK Tyrosine-protein kinase BTK (BTK)
Type:
Enzyme
Mol. Mass.:
76289.95
Organism:
Homo sapiens (Human)
Description:
Q06187
Residue:
659
  
Inhibitor
Name:
BDBM380430
Synonyms:
(E)-5-amino-1-(2-(4-(dimethylamino)-N-methylbut-2-enamido)ethyl)-3-(4-phenoxyphenyl)-1H-pyrazole-4-carboxamide | US9926299, 35
Type:
Small organic molecule
Emp. Form.:
C25H30N6O3
Mol. Mass.:
462.5441
SMILES:
CN(C)C\C=C\C(=O)N(C)CCn1nc(c(C(N)=O)c1N)-c1ccc(Oc2ccccc2)cc1
: