Target
Tyrosine-protein phosphatase non-receptor type 11
Ligand
BDBM24515
Substrate
BDBM24514
Meas. Tech.
SHP-2 Inhibition Assay
pH
7±n/a
Temperature
298.15±n/a K
Ki
25600±n/a nM
Citation
 Geronikaki, AEleftheriou, PVicini, PAlam, IDixit, ASaxena, AK 2-Thiazolylimino/heteroarylimino-5-arylidene-4-thiazolidinones as new agents with SHP-2 inhibitory action. J Med Chem 51:5221-8 (2008)  
Target
Name:
Tyrosine-protein phosphatase non-receptor type 11
Synonyms:
3.1.3.48 PTP-1D PTP2C Protein Tyrosine Phosphatase PPN11/Shp2 Protein-Tyrosine Phosphatase SHP-2 Protein-tyrosine phosphatase 2C SH-PTP3 SHP2 Src homology phosphatase 2 (SHP-2) Tyrosine-protein phosphatase non-receptor type 11 (SHP-2) | Tyrosine-protein phosphatase non-receptor type 11 (SHP2)
Type:
Protein phosphatase
Mol. Mass.:
68443.59
Organism:
Homo sapiens (Human)
Description:
Q06124
Residue:
593
  
Inhibitor
Name:
BDBM24515
Synonyms:
(2E,5E)-5-[(4-hydroxy-3-methoxyphenyl)methylidene]-2-(1,3-thiazol-2-ylimino)-1,3-thiazolidin-4-one | Thiazole analogue, 2
Type:
Small organic molecule
Emp. Form.:
C14H11N3O3S2
Mol. Mass.:
333.385
SMILES:
COc1cc(\C=C2\S\C(NC2=O)=N\c2nccs2)ccc1O
:
Substrate
Name:
BDBM24514
Synonyms:
4-nitrophenoxyphosphonic acid CHEMBL24231 | p-nitrophenyl phosphate
Type:
Small organic molecule
Emp. Form.:
C6H6NO6P
Mol. Mass.:
219.0887
SMILES:
OP(O)(=O)Oc1ccc(cc1)[N+]([O-])=O
: