Target
Ectonucleotide pyrophosphatase/phosphodiesterase family member 2
Ligand
BDBM380503
Substrate
Meas. Tech.
Autotaxin Assay
IC50
<500±n/a nM
Citation
 Hutchinson, JHLonergan, DRowbottom, MLai, AG Tetracyclic autotaxin inhibitors US Patent  US9926318 Publication Date 3/27/2018 
Target
Name:
Ectonucleotide pyrophosphatase/phosphodiesterase family member 2
Synonyms:
ATX Autotaxin (ATX) ENPP2 Ectonucleotide Pyrophosphatase/Phosphodiesterase 2 (ENPP2) Extracellular lysophospholipase D PDNP2
Type:
Enzyme
Mol. Mass.:
99007.13
Organism:
Homo sapiens (Human)
Description:
Q13822
Residue:
863
  
Inhibitor
Name:
BDBM380503
Synonyms:
US9926318, 1-23
Type:
Small organic molecule
Emp. Form.:
C23H20FN3O4
Mol. Mass.:
421.421
SMILES:
OC(=O)CN1CC(=O)N2Cc3c(CC2C1=O)c1ccccc1n3Cc1ccc(F)cc1
: