Target
Ectonucleotide pyrophosphatase/phosphodiesterase family member 2
Ligand
BDBM380508
Substrate
Meas. Tech.
Autotaxin Assay
IC50
<500±n/a nM
Citation
 Hutchinson, JHLonergan, DRowbottom, MLai, AG Tetracyclic autotaxin inhibitors US Patent  US9926318 Publication Date 3/27/2018 
Target
Name:
Ectonucleotide pyrophosphatase/phosphodiesterase family member 2
Synonyms:
ATX Autotaxin (ATX) ENPP2 Ectonucleotide Pyrophosphatase/Phosphodiesterase 2 (ENPP2) Extracellular lysophospholipase D PDNP2
Type:
Enzyme
Mol. Mass.:
99007.13
Organism:
Homo sapiens (Human)
Description:
Q13822
Residue:
863
  
Inhibitor
Name:
BDBM380508
Synonyms:
US9926318, 1-34
Type:
Small organic molecule
Emp. Form.:
C25H22FN3O4
Mol. Mass.:
447.4583
SMILES:
OC(=O)C1(CN2C(=O)[C@@H]3Cc4c(CN3C2=O)n(Cc2ccc(F)cc2)c2ccccc42)CC1
: