Target
DNA gyrase subunit A/B
Ligand
BDBM24614
Substrate
BDBM2
Meas. Tech.
DNA Gyrase ATPase Assay
pH
7.5±n/a
Temperature
303.15±n/a K
Ki
16±n/a nM
Citation
 Charifson, PSGrillot, ALGrossman, THParsons, JDBadia, MBellon, SDeininger, DDDrumm, JEGross, CHLeTiran, ALiao, YMani, NNicolau, DPPerola, ERonkin, SShannon, DSwenson, LLTang, QTessier, PRTian, SKTrudeau, MWang, TWei, YZhang, HStamos, D Novel dual-targeting benzimidazole urea inhibitors of DNA gyrase and topoisomerase IV possessing potent antibacterial activity: intelligent design and evolution through the judicious use of structure-guided design and structure-activity relationships. J Med Chem 51:5243-63 (2008)  
Target
Name:
DNA gyrase subunit A/B
Synonyms:
DNA Gyrase
Type:
A2B2 tetramer
Mol. Mass.:
Description:
Components:
This complex has 2 components.
Component 1
Name:
DNA gyrase subunit A
Synonyms:
DNA gyrase subunit A (gyrA) gyrA
Type:
Enzyme Subunit
Mol. Mass.:
99588.82
Organism:
Staphylococcus aureus
Description:
Residue:
889
  
Component 2
Name:
DNA gyrase subunit B
Synonyms:
DNA gyrase DNA gyrase subunit B (gyrB) gyrB
Type:
Enzyme Subunit
Mol. Mass.:
72530.91
Organism:
Staphylococcus aureus
Description:
Residue:
644
  
Inhibitor
Name:
BDBM24614
Synonyms:
3-ethyl-1-[7-(1H-pyrazol-1-yl)-5-(pyrimidin-5-yl)-1H-1,3-benzodiazol-2-yl]urea | Benzimidazole urea analogue, 18
Type:
Small organic molecule
Emp. Form.:
C17H16N8O
Mol. Mass.:
348.3619
SMILES:
CCNC(=O)Nc1nc2c(cc(cc2[nH]1)-c1cncnc1)-n1cccn1
:
Substrate
Name:
BDBM2
Synonyms:
({[({[(2R,3S,4R,5R)-5-(6-amino-9H-purin-9-yl)-3,4-dihydroxyoxolan-2-yl]methoxy}(hydroxy)phosphoryl)oxy](hydroxy)phosphoryl}oxy)phosphonic acid Brimonidine ATP | CHEMBL14249
Type:
Nucleoside or nucleotide
Emp. Form.:
C10H16N5O13P3
Mol. Mass.:
507.181
SMILES:
Nc1ncnc2n(cnc12)[C@@H]1O[C@H](COP(O)(=O)OP(O)(=O)OP(O)(O)=O)[C@@H](O)[C@H]1O
: