Target
Fibroblast growth factor receptor 4
Ligand
BDBM262051
Substrate
Meas. Tech.
FGFR Enzymatic Assay 2
IC50
20±n/a nM
Citation
 Lu, LShen, BSokolsky, AWang, XWu, LYao, WYe, Y Bicyclic heterocycles as FGFR4 inhibitors US Patent  US9708318 Publication Date 7/18/2017 
Target
Name:
Fibroblast growth factor receptor 4
Synonyms:
CD_antigen: CD334 FGFR4 FGFR4 Fibroblast growth factor receptor JK2 TKF
Type:
Protein
Mol. Mass.:
87957.45
Organism:
Homo sapiens (Human)
Description:
P22455
Residue:
802
  
Inhibitor
Name:
BDBM262051
Synonyms:
3-(2,6-difluoro-3,5- dimethoxyphenyl)-1-ethyl-7-(1- methyl-1H-pyrazol-4-yl)-3,4- dihydropyrido[4,3-d]pyrimidin-2(1H)- one US10632126, Example 169 US9708318, 169
Type:
Small organic molecule
Emp. Form.:
C21H21F2N5O3
Mol. Mass.:
429.4199
SMILES:
CCN1C(=O)N(Cc2cnc(cc12)-c1cnn(C)c1)c1c(F)c(OC)cc(OC)c1F
: