Target
Serine/threonine-protein kinase pim-1
Ligand
BDBM291214
Substrate
Meas. Tech.
Enzyme Assay
IC50
<10±n/a nM
Citation
 Sun, YFeng, HLi, YMei, SPan, JWang, AYe, HZhang, K Bicyclic aromatic carboxamide compounds useful as pim kinase inhibitors US Patent  US9890162 Publication Date 2/13/2018 
Target
Name:
Serine/threonine-protein kinase pim-1
Synonyms:
PIM-1 Kinase PIM1_HUMAN Serine/threonine-protein kinase (PIM1) Serine/threonine-protein kinase PIM1 | Serine/threonine-protein kinase pim-1 (PIM1)
Type:
Protein
Mol. Mass.:
35681.82
Organism:
Homo sapiens (Human)
Description:
P11309
Residue:
313
  
Inhibitor
Name:
BDBM291214
Synonyms:
N-{4-[(3S,5R)-3-Amino-5-methylpiperidin-1-yl]pyridin-3-yl}-7-azetidin-1-ylquinoline-2-carboxamide US9890162, Example 34
Type:
Small organic molecule
Emp. Form.:
C24H28N6O
Mol. Mass.:
416.5187
SMILES:
C[C@@H]1C[C@H](N)CN(C1)c1ccncc1NC(=O)c1ccc2ccc(cc2n1)N1CCC1
: