Target
CREB-binding protein
Ligand
BDBM380770
Substrate
Meas. Tech.
AlphaScreen In-Vitro Binding Assay
IC50
>37000±n/a nM
Citation
 Blank, JBold, GCotesta, SGuagnano, VRueeger, HVaupel, A Imidazopyrrolidine derivatives and their use in the treatment of disease US Patent  US9890166 Publication Date 2/13/2018 
Target
Name:
CREB-binding protein
Synonyms:
CBP CREB-binding protein (CBP) CREBBP
Type:
Transcription Coactivator
Mol. Mass.:
265411.66
Organism:
Homo sapiens (Human)
Description:
Q92793
Residue:
2442
  
Inhibitor
Name:
BDBM380770
Synonyms:
6-(4-chlorophenyl)-2-(3,6-dihydro-2H-pyran-4-yl)-5-(3,7-dimethyl-3H-[1,2,3]triazolo[4,5-b]pyridin-5-yl)-1-isopropyl-5,6-dihydropyrrolo[3,4-d]imidazol-4(1H)-one | US9890166, Example 160
Type:
Small organic molecule
Emp. Form.:
C26H26ClN7O2
Mol. Mass.:
503.983
SMILES:
CC(C)n1c(nc2C(=O)N(C(c12)c1ccc(Cl)cc1)c1cc(C)c2nnn(C)c2n1)C1=CCOCC1
: