Target
Ribosomal protein S6 kinase alpha-5
Ligand
BDBM24991
Substrate
Fluorescent-labeled Crosstide
Meas. Tech.
In Vitro Kinase Inhibition Assay
IC50
3±n/a nM
Citation
 Heerding, DARhodes, NLeber, JDClark, TJKeenan, RMLafrance, LVLi, MSafonov, IGTakata, DTVenslavsky, JWYamashita, DSChoudhry, AECopeland, RALai, ZSchaber, MDTummino, PJStrum, SLWood, ERDuckett, DREberwein, DKnick, VBLansing, TJMcConnell, RTZhang, SMinthorn, EAConcha, NOWarren, GLKumar, R Identification of 4-(2-(4-amino-1,2,5-oxadiazol-3-yl)-1-ethyl-7-{[(3S)-3-piperidinylmethyl]oxy}-1H-imidazo[4,5-c]pyridin-4-yl)-2-methyl-3-butyn-2-ol (GSK690693), a novel inhibitor of AKT kinase. J Med Chem 51:5663-79 (2008)  
Target
Name:
Ribosomal protein S6 kinase alpha-5
Synonyms:
90 kDa ribosomal protein S6 kinase 5 MSK1 Nuclear mitogen- and stress-activated protein kinase 1 RPS6KA5 RSK-like protein kinase Ribosomal protein S6 kinase Ribosomal protein S6 kinase alpha-5
Type:
Serine/threonine-protein kinase
Mol. Mass.:
89874.44
Organism:
Homo sapiens (Human)
Description:
Residue:
802
  
Inhibitor
Name:
BDBM24991
Synonyms:
4-(7-{[(3R)-3-aminopyrrolidin-1-yl]carbonyl}-1-ethyl-1H-imidazo[4,5-c]pyridin-2-yl)-1,2,5-oxadiazol-3-amine | oxadiazole-containing compound, 4
Type:
Small organic molecule
Emp. Form.:
C15H18N8O2
Mol. Mass.:
342.3558
SMILES:
CCn1c(nc2cncc(C(=O)N3CC[C@@H](N)C3)c12)-c1nonc1N
:
Substrate
Name:
Fluorescent-labeled Crosstide
Synonyms:
5(6)-Carboxytetramethylrhodamine-labeled peptide | TAMRA-labeled peptide
Type:
Fluorescent dye labeled peptide
Mol. Mass.:
1165.24
Organism:
Description:
Residue:
11
GRPRTSSFAEG