Target
NAD(P)H dehydrogenase [quinone] 1
Ligand
BDBM381911
Substrate
Meas. Tech.
BEAS-2B NQO1 MTT Assay
EC50
5.5±n/a nM
Citation
 Kerns, JKCallahan, JFYan, HHeightman, TDBoehm, JCWoolford, AJ NRF2 regulators US Patent  US10272095 Publication Date 4/30/2019 
Target
Name:
NAD(P)H dehydrogenase [quinone] 1
Synonyms:
Azoreductase DT-diaphorase NAD(P)H:quinone oxidoreductase 1 NQO1 Phylloquinone reductase Quinone Reductase 1 | Quinone reductase 1)
Type:
Homodimer
Mol. Mass.:
30874.82
Organism:
Homo sapiens (Human)
Description:
Residue:
274
  
Inhibitor
Name:
BDBM381911
Synonyms:
US10272095, Example 73 | rel-(R)-3-(1,4-Dimethyl-1H- benzo[d][1,2,3]triazol-5-yl)- 3-(rel-(R)-3-((R)-2-ethyl-2,3- dihydropyrido[3,4- f][1,4]oxazepin-4(5H)-yl)- 2,3-dihydro-1H-inden-5-yl)- 2,2-dimethylpropanoic acid
Type:
Small organic molecule
Emp. Form.:
C32H37N5O3
Mol. Mass.:
539.6679
SMILES:
Cc1c(ccc2n(C)nnc12)[C@@H](c1ccc2CC[C@@H](N3Cc4cnccc4OC(C)(C)C3)c2c1)C(C)(C)C(O)=O
: