Target
Serine/threonine-protein kinase PLK1
Ligand
BDBM8826
Substrate
Biotinylated PLKtide
Meas. Tech.
PLK Kinase Assay
pH
7.5±n/a
Temperature
295.15±n/a K
Ki
>20000±n/a nM
Km
200±n/a nM
Citation
 Johnson, EFStewart, KDWoods, KWGiranda, VLLuo, Y Pharmacological and functional comparison of the polo-like kinase family: insight into inhibitor and substrate specificity. Biochemistry 46:9551-63 (2007)  
Target
Name:
Serine/threonine-protein kinase PLK1
Synonyms:
PLK PLK1 Polo-like kinase 1 (PlK1) STPK13 Serine/threonine-protein kinase 13 | polo-like kinase
Type:
Serine/threonine-protein kinase
Mol. Mass.:
68277.16
Organism:
Homo sapiens (Human)
Description:
P53350
Residue:
603
  
Inhibitor
Name:
BDBM8826
Synonyms:
3-(4-{4-aminothieno[2,3-d]pyrimidin-5-yl}phenyl)-1-(3-methylphenyl)urea CHEMBL196363 N-[4-(4-Aminothieno[2,3-d]pyrimidin-5-yl)phenyl]-N -(3-methylphenyl)urea | Thienopyrimidine deriv. 76
Type:
Small organic molecule
Emp. Form.:
C20H17N5OS
Mol. Mass.:
375.447
SMILES:
Cc1cccc(NC(=O)Nc2ccc(cc2)-c2csc3ncnc(N)c23)c1
:
Substrate
Name:
Biotinylated PLKtide
Synonyms:
Type:
Peptide
Mol. Mass.:
1447.52
Organism:
Description:
Residue:
13
EVIEASFAEQEAK