Target
Serine/threonine-protein kinase PLK1
Ligand
BDBM16919
Substrate
Biotinylated PLKtide
Meas. Tech.
PLK Kinase Assay
pH
7.5±n/a
Temperature
295.15±n/a K
Ki
10000±n/a nM
Km
200±n/a nM
Citation
 Johnson, EFStewart, KDWoods, KWGiranda, VLLuo, Y Pharmacological and functional comparison of the polo-like kinase family: insight into inhibitor and substrate specificity. Biochemistry 46:9551-63 (2007)  
Target
Name:
Serine/threonine-protein kinase PLK1
Synonyms:
PLK PLK1 Polo-like kinase 1 (PlK1) STPK13 Serine/threonine-protein kinase 13 | polo-like kinase
Type:
Serine/threonine-protein kinase
Mol. Mass.:
68277.16
Organism:
Homo sapiens (Human)
Description:
P53350
Residue:
603
  
Inhibitor
Name:
BDBM16919
Synonyms:
3-[(2S)-2-amino-3-[(5-{thieno[2,3-c]pyridin-2-yl}pyridin-3-yl)oxy]propyl]-1H-indole CHEMBL516429 | thieno[2,3-c]pyridine, 9a
Type:
Small organic molecule
Emp. Form.:
C23H20N4OS
Mol. Mass.:
400.496
SMILES:
N[C@H](COc1cncc(c1)-c1cc2ccncc2s1)Cc1c[nH]c2ccccc12
:
Substrate
Name:
Biotinylated PLKtide
Synonyms:
Type:
Peptide
Mol. Mass.:
1447.52
Organism:
Description:
Residue:
13
EVIEASFAEQEAK