Target
Serine/threonine-protein kinase PLK3
Ligand
BDBM25120
Substrate
Biotinylated PLKtide
Meas. Tech.
PLK Kinase Assay
Ki
8±n/a nM
Citation
 Johnson, EFStewart, KDWoods, KWGiranda, VLLuo, Y Pharmacological and functional comparison of the polo-like kinase family: insight into inhibitor and substrate specificity. Biochemistry 46:9551-63 (2007)  
Target
Name:
Serine/threonine-protein kinase PLK3
Synonyms:
CNK FGF-inducible kinase PLK3 PRK Proliferation-related kinase | Serine/threonine-protein kinase PLK3
Type:
Serine/threonine-protein kinase
Mol. Mass.:
71655.17
Organism:
Homo sapiens (Human)
Description:
Enzyme assays were using PLK3 purified from baculovirus-infected Trichoplusia ni cells expressing full-length PLK3.
Residue:
646
  
Inhibitor
Name:
BDBM25120
Synonyms:
5-(5,6-dimethoxy-1H-1,3-benzodiazol-1-yl)-3-{[2-(trifluoromethyl)phenyl]methoxy}thiophene-2-carboxamide thiophene deriv., 20
Type:
Small organic molecule
Emp. Form.:
C22H18F3N3O4S
Mol. Mass.:
477.456
SMILES:
COc1cc2ncn(-c3cc(OCc4ccccc4C(F)(F)F)c(s3)C(N)=O)c2cc1OC
:
Substrate
Name:
Biotinylated PLKtide
Synonyms:
Type:
Peptide
Mol. Mass.:
1447.52
Organism:
Description:
Residue:
13
EVIEASFAEQEAK