Target
Serine/threonine-protein kinase PLK4
Ligand
BDBM25113
Substrate
Biotinylated Peptide A-A11
Meas. Tech.
PLK Kinase Assay
Ki
9200±n/a nM
Citation
 Johnson, EFStewart, KDWoods, KWGiranda, VLLuo, Y Pharmacological and functional comparison of the polo-like kinase family: insight into inhibitor and substrate specificity. Biochemistry 46:9551-63 (2007)  
Target
Name:
Serine/threonine-protein kinase PLK4
Synonyms:
PLK4 Polo-Like Kinase 4 STK18 | Serine/threonine-protein kinase PLK4
Type:
PROTEIN
Mol. Mass.:
108996.91
Organism:
Homo sapiens (Human)
Description:
ChEMBL_1474078
Residue:
970
  
Inhibitor
Name:
BDBM25113
Synonyms:
5-(4-aminophenyl)thieno[2,3-d]pyrimidin-4-amine | thienopyrimidine analogue, 1
Type:
Small organic molecule
Emp. Form.:
C12H10N4S
Mol. Mass.:
242.3
SMILES:
Nc1ccc(cc1)-c1csc2ncnc(N)c12
:
Substrate
Name:
Biotinylated Peptide A-A11
Synonyms:
Type:
Peptide
Mol. Mass.:
1379.40
Organism:
Description:
Residue:
13
TPSDSLIYDDGLS