Target
Serine/threonine-protein kinase PLK4
Ligand
BDBM25114
Substrate
Biotinylated Peptide A-A11
Meas. Tech.
PLK Kinase Assay
Ki
540±n/a nM
Citation
 Johnson, EFStewart, KDWoods, KWGiranda, VLLuo, Y Pharmacological and functional comparison of the polo-like kinase family: insight into inhibitor and substrate specificity. Biochemistry 46:9551-63 (2007)  
Target
Name:
Serine/threonine-protein kinase PLK4
Synonyms:
PLK4 Polo-Like Kinase 4 STK18 | Serine/threonine-protein kinase PLK4
Type:
PROTEIN
Mol. Mass.:
108996.91
Organism:
Homo sapiens (Human)
Description:
ChEMBL_1474078
Residue:
970
  
Inhibitor
Name:
BDBM25114
Synonyms:
N-(4-{4-aminothieno[2,3-d]pyrimidin-5-yl}phenyl)benzamide | thienopyrimidine analogue, 2
Type:
Small organic molecule
Emp. Form.:
C19H14N4OS
Mol. Mass.:
346.406
SMILES:
Nc1ncnc2scc(-c3ccc(NC(=O)c4ccccc4)cc3)c12
:
Substrate
Name:
Biotinylated Peptide A-A11
Synonyms:
Type:
Peptide
Mol. Mass.:
1379.40
Organism:
Description:
Residue:
13
TPSDSLIYDDGLS