Target
Serine/threonine-protein kinase PLK4
Ligand
BDBM16919
Substrate
Biotinylated Peptide A-A11
Meas. Tech.
PLK Kinase Assay
Ki
440±n/a nM
Citation
 Johnson, EFStewart, KDWoods, KWGiranda, VLLuo, Y Pharmacological and functional comparison of the polo-like kinase family: insight into inhibitor and substrate specificity. Biochemistry 46:9551-63 (2007)  
Target
Name:
Serine/threonine-protein kinase PLK4
Synonyms:
PLK4 Polo-Like Kinase 4 STK18 | Serine/threonine-protein kinase PLK4
Type:
PROTEIN
Mol. Mass.:
108996.91
Organism:
Homo sapiens (Human)
Description:
ChEMBL_1474078
Residue:
970
  
Inhibitor
Name:
BDBM16919
Synonyms:
3-[(2S)-2-amino-3-[(5-{thieno[2,3-c]pyridin-2-yl}pyridin-3-yl)oxy]propyl]-1H-indole CHEMBL516429 | thieno[2,3-c]pyridine, 9a
Type:
Small organic molecule
Emp. Form.:
C23H20N4OS
Mol. Mass.:
400.496
SMILES:
N[C@H](COc1cncc(c1)-c1cc2ccncc2s1)Cc1c[nH]c2ccccc12
:
Substrate
Name:
Biotinylated Peptide A-A11
Synonyms:
Type:
Peptide
Mol. Mass.:
1379.40
Organism:
Description:
Residue:
13
TPSDSLIYDDGLS